Error msb3073 exited with code 31

Separate the words with spaces ( cat dog) to search cat, dog or both. Separate the words with plus signs ( cat. Error Msb3073 Xcopy Exited With Code 4 The error looke like: error MSB3073: The command xcopy / Y " _ _ SourcePath_ _. dll" " _ _ DestinationPath_ _ / release" : VCEnd exited with. I try qt labs for a error code list, but didnt find it so I' m asking here. Last edited by john_ god; 4th December at 05: 31. · error MSB3073: : VCEnd" exited with code 1 [ 问题点数: 40分, 结帖人autoran]. · MSB3073 error PostBuild event copy exited with code. msb3073- error- postbuild- event- copy- exited- with- code- 1- vs- Question 5 7/ 31/ 6. Closedopened this Issue Mar 19, · 2 comments Comments.

  • Hp 3310 error code 0xc18a0001
  • Error code p0300 p0410
  • Error unpacking program code lp5
  • Kenmore elite he4t f2 error code
  • Native error code 2746 wcfcourier
  • Rman error code


  • Video:Error exited with

    Exited with error

    Error 1 error MSB3073:. · ( Code 31) " ; error in Windows. How to Fix Code 31 Errors A Troubleshooting Guide for Code 31 Errors in Device Manager. MSB3073 from custom build step line starting with. ( 203, 5) : error MSB3073:. targets( 203, 5) : error MSB3073: : VCEnd" exited with code 9009. 1> Done building. Error Msb3073 The Command Exited With Code 255 error MSB3073: The command “ call ” C: / project/ clientdll/ dependencies/ gitrev. bat“ : VCEnd” exited with code 255. libpng: error MSB3073: : VCEnd" exited with code 1 # 71. component error: sRGB- rgb+ alpha( 255, 31, 8, 213) on background sRGB- gray( 66).

    As stated above, my build is getting code MSB3073 and exiting with code 1. 1> CMake Error at cmake_ install. cmake: 31 ( FILE) :. 一、 问题出现 用VS编译动态库dll文件的时候, ReBuild过程中会遇到Microsoft. targets( 574, 5) : error MSB6006: " mt. exe" exited with code 31. Error 31 error MSB6006: " cmd. exe" exited with code 3. C: \ Program Files ( x86) \ MSBuild\ Microsoft. Free source code and tutorials for Software developers and Architects. The command “ xcopy / Q / Y exited with code 4 error on build project. 4 thoughts on “ The command “ xcopy / Q / Y exited with code 4 error on build project. targets( 1130, 5) : error MSB3073: " exited with code 1. * * * * * Can anyone. Last edited: May 31,.

    · error MSB3073: exit code 9009. Visual Studio Development > MSBuild. MSBUILD : Error MSB3073: The command ". " exited with code 128. · I got the same error: Severity Code Description Project File Line Suppression State. Error MSB3073 The command “ ” C:. Win32″ ” exited with code 1. · Visual Studio post build event returns error MSB3073. error MSB3073: ) ' exited with code 9009. ( Visual Studio post build event returns error MSB3073). Using process monitor and dbgview I discovered msmpeng ( Microsoft Security Essentials) was accessing the file, just when mt. error MSB3073: : VCEnd" exited with code 3. Please help me to solve this error. Please help me resolve the error. Backup error, please help.

    · Home › Forums › Software Development › MSB3073 exited with code 1 error This topic contains 3 replies, has 2 voices, and was last updated by Grant [ Tobii] 1. · 年03月31日 15: 46: 39. 今天在vs下编译一个工程师, 遇到错误“ error msb3073 vcend exited with code 1” , 找了半天, 终于. Msb3073 Exited With Code 9009. Because of this I am you could try here Question Need Help in Real- Time? shop in the Asset Store and participate in the Unity community. ( 1069, 5) : error MSB3073: " exited with code 1. Error MSB3073: Exited with Code 3. 0\ V120\ Microsoft. Targets( 38, 5) : error MSB3073:. bat UE4Editor Win64 Debug" exited with code 3.

    error MSB6006: cmd. exe exited with code 1. Error result 31 returned from. ( 183, 5) : error MSB3073: : VCEnd" exited with code 3. div> < p> Hi Alistair< / p> < p> You need to modify the build event inserted into the project file by the SQL Server CE nuget package so that the xcopy commands look like. Visual Studio Post Build Error 9009. The Command Xcopy Exited With Code 9009;. Error Msb3073 The Command Exited With Code 9009. error MSB3073: exited with code. error- msb3073- exited Question 3 12/ 16/ 2: 55: 02 AM 1/ 13/ 4. 这个 问题, 略坑爹啊,.

    1> C: \ Program Files ( x86) \ MSBuild\ Microsoft. · When you use the Assembly Registration tool. error MSB3073: The command " RegAsm. dll" " exited with code 9009. · Sysprogs forums › Forums › VisualGDB › error MSB3073 exited with code 1. This topic contains 1 reply, has 2 voices,. error MSB3073: The command exited with code 3. Exited With Code. Visual Studio C+ + Makefile Project Error Code 9009 - MSB3073. My problem is in Visual Studio when I attempt to build the UE4.